Skip to content

PR #1509

PR #1509 #2182

Triggered via dynamic February 25, 2025 23:05
Status Success
Total duration 7m 32s
Artifacts

codeql

on: dynamic
Matrix: analyze
Fit to window
Zoom out
Zoom in

Annotations

11 errors
bio.terra.pearl.api.admin.service.admin.AdminUserExtServiceTests ► testSetRolesLimitedByOperator(TestInfo): api-admin/build/test-results/test/TEST-bio.terra.pearl.api.admin.service.admin.AdminUserExtServiceTests.xml#L0
Failed test found in: api-admin/build/test-results/test/TEST-bio.terra.pearl.api.admin.service.admin.AdminUserExtServiceTests.xml api-admin/build/test-results/test/TEST-bio.terra.pearl.api.admin.service.admin.AdminUserExtServiceTests.xml api-admin/build/test-results/test/TEST-bio.terra.pearl.api.admin.service.admin.AdminUserExtServiceTests.xml api-admin/build/test-results/test/TEST-bio.terra.pearl.api.admin.service.admin.AdminUserExtServiceTests.xml api-admin/build/test-results/test/TEST-bio.terra.pearl.api.admin.service.admin.AdminUserExtServiceTests.xml api-admin/build/test-results/test/TEST-bio.terra.pearl.api.admin.service.admin.AdminUserExtServiceTests.xml api-admin/build/test-results/test/TEST-bio.terra.pearl.api.admin.service.admin.AdminUserExtServiceTests.xml Error: java.lang.IllegalStateException: Failed to load ApplicationContext for [WebMergedContextConfiguration@37694cd8 testClass = bio.terra.pearl.api.admin.service.admin.AdminUserExtServiceTests, locations = [], classes = [bio.terra.pearl.api.admin.ApiAdminApp], contextInitializerClasses = [], activeProfiles = ["test", "human-readable-logging"], propertySourceLocations = [], propertySourceProperties = ["org.springframework.boot.test.context.SpringBootTestContextBootstrapper=true"], contextCustomizers = [org.springframework.boot.test.autoconfigure.actuate.observability.ObservabilityContextCustomizerFactory$DisableObservabilityContextCustomizer@1f, org.springframework.boot.test.autoconfigure.properties.PropertyMappingContextCustomizer@0, org.springframework.boot.test.autoconfigure.web.servlet.WebDriverContextCustomizerFactory$Customizer@6b4125ed, org.springframework.boot.test.context.filter.ExcludeFilterContextCustomizer@6b321262, org.springframework.boot.test.json.DuplicateJsonObjectContextCustomizerFactory$DuplicateJsonObjectContextCustomizer@4ea17147, org.springframework.boot.test.mock.mockito.MockitoContextCustomizer@0, org.springframework.boot.test.web.client.TestRestTemplateContextCustomizer@7f6b2d9e, org.springframework.boot.test.web.reactive.server.WebTestClientContextCustomizer@7c540787, org.springframework.boot.test.context.SpringBootTestAnnotation@95d9e03b], resourceBasePath = "src/main/webapp", contextLoader = org.springframework.boot.test.context.SpringBootContextLoader, parent = null]
bio.terra.pearl.api.admin.service.admin.PermissionServiceTests ► updatePermissionDescription(TestInfo): api-admin/build/test-results/test/TEST-bio.terra.pearl.api.admin.service.admin.PermissionServiceTests.xml#L0
Failed test found in: api-admin/build/test-results/test/TEST-bio.terra.pearl.api.admin.service.admin.PermissionServiceTests.xml Error: java.lang.IllegalStateException: Failed to load ApplicationContext for [WebMergedContextConfiguration@628e7010 testClass = bio.terra.pearl.api.admin.service.admin.PermissionServiceTests, locations = [], classes = [bio.terra.pearl.api.admin.ApiAdminApp], contextInitializerClasses = [], activeProfiles = ["test", "human-readable-logging"], propertySourceLocations = [], propertySourceProperties = ["org.springframework.boot.test.context.SpringBootTestContextBootstrapper=true"], contextCustomizers = [org.springframework.boot.test.autoconfigure.actuate.observability.ObservabilityContextCustomizerFactory$DisableObservabilityContextCustomizer@1f, org.springframework.boot.test.autoconfigure.properties.PropertyMappingContextCustomizer@0, org.springframework.boot.test.autoconfigure.web.servlet.WebDriverContextCustomizerFactory$Customizer@6b4125ed, org.springframework.boot.test.context.filter.ExcludeFilterContextCustomizer@6b321262, org.springframework.boot.test.json.DuplicateJsonObjectContextCustomizerFactory$DuplicateJsonObjectContextCustomizer@4ea17147, org.springframework.boot.test.mock.mockito.MockitoContextCustomizer@0, org.springframework.boot.test.web.client.TestRestTemplateContextCustomizer@7f6b2d9e, org.springframework.boot.test.web.reactive.server.WebTestClientContextCustomizer@7c540787, org.springframework.boot.test.context.SpringBootTestAnnotation@95d9e03b], resourceBasePath = "src/main/webapp", contextLoader = org.springframework.boot.test.context.SpringBootContextLoader, parent = null]
bio.terra.pearl.api.admin.service.admin.RoleServiceTests ► updateRoleDescription(TestInfo): api-admin/build/test-results/test/TEST-bio.terra.pearl.api.admin.service.admin.RoleServiceTests.xml#L0
Failed test found in: api-admin/build/test-results/test/TEST-bio.terra.pearl.api.admin.service.admin.RoleServiceTests.xml Error: java.lang.IllegalStateException: Failed to load ApplicationContext for [WebMergedContextConfiguration@2f1793b6 testClass = bio.terra.pearl.api.admin.service.admin.RoleServiceTests, locations = [], classes = [bio.terra.pearl.api.admin.ApiAdminApp], contextInitializerClasses = [], activeProfiles = ["test", "human-readable-logging"], propertySourceLocations = [], propertySourceProperties = ["org.springframework.boot.test.context.SpringBootTestContextBootstrapper=true"], contextCustomizers = [org.springframework.boot.test.autoconfigure.actuate.observability.ObservabilityContextCustomizerFactory$DisableObservabilityContextCustomizer@1f, org.springframework.boot.test.autoconfigure.properties.PropertyMappingContextCustomizer@0, org.springframework.boot.test.autoconfigure.web.servlet.WebDriverContextCustomizerFactory$Customizer@6b4125ed, org.springframework.boot.test.context.filter.ExcludeFilterContextCustomizer@6b321262, org.springframework.boot.test.json.DuplicateJsonObjectContextCustomizerFactory$DuplicateJsonObjectContextCustomizer@4ea17147, org.springframework.boot.test.mock.mockito.MockitoContextCustomizer@0, org.springframework.boot.test.web.client.TestRestTemplateContextCustomizer@7f6b2d9e, org.springframework.boot.test.web.reactive.server.WebTestClientContextCustomizer@7c540787, org.springframework.boot.test.context.SpringBootTestAnnotation@95d9e03b], resourceBasePath = "src/main/webapp", contextLoader = org.springframework.boot.test.context.SpringBootContextLoader, parent = null]
bio.terra.pearl.api.admin.service.auth.AuthUtilServiceTests ► authUserToPortalRejectsUsersNotInPortal(TestInfo): api-admin/build/test-results/test/TEST-bio.terra.pearl.api.admin.service.auth.AuthUtilServiceTests.xml#L0
Failed test found in: api-admin/build/test-results/test/TEST-bio.terra.pearl.api.admin.service.auth.AuthUtilServiceTests.xml api-admin/build/test-results/test/TEST-bio.terra.pearl.api.admin.service.auth.AuthUtilServiceTests.xml api-admin/build/test-results/test/TEST-bio.terra.pearl.api.admin.service.auth.AuthUtilServiceTests.xml api-admin/build/test-results/test/TEST-bio.terra.pearl.api.admin.service.auth.AuthUtilServiceTests.xml api-admin/build/test-results/test/TEST-bio.terra.pearl.api.admin.service.auth.AuthUtilServiceTests.xml api-admin/build/test-results/test/TEST-bio.terra.pearl.api.admin.service.auth.AuthUtilServiceTests.xml Error: java.lang.IllegalStateException: Failed to load ApplicationContext for [WebMergedContextConfiguration@36a73e3b testClass = bio.terra.pearl.api.admin.service.auth.AuthUtilServiceTests, locations = [], classes = [bio.terra.pearl.api.admin.ApiAdminApp], contextInitializerClasses = [], activeProfiles = ["test", "human-readable-logging"], propertySourceLocations = [], propertySourceProperties = ["org.springframework.boot.test.context.SpringBootTestContextBootstrapper=true"], contextCustomizers = [org.springframework.boot.test.autoconfigure.actuate.observability.ObservabilityContextCustomizerFactory$DisableObservabilityContextCustomizer@1f, org.springframework.boot.test.autoconfigure.properties.PropertyMappingContextCustomizer@0, org.springframework.boot.test.autoconfigure.web.servlet.WebDriverContextCustomizerFactory$Customizer@6b4125ed, org.springframework.boot.test.context.filter.ExcludeFilterContextCustomizer@6b321262, org.springframework.boot.test.json.DuplicateJsonObjectContextCustomizerFactory$DuplicateJsonObjectContextCustomizer@4ea17147, org.springframework.boot.test.mock.mockito.MockitoContextCustomizer@0, org.springframework.boot.test.web.client.TestRestTemplateContextCustomizer@7f6b2d9e, org.springframework.boot.test.web.reactive.server.WebTestClientContextCustomizer@7c540787, org.springframework.boot.test.context.SpringBootTestAnnotation@95d9e03b], resourceBasePath = "src/main/webapp", contextLoader = org.springframework.boot.test.context.SpringBootContextLoader, parent = null]
bio.terra.pearl.api.admin.service.auth.EnforcePortalEnrolleePermissionTest ► testEnforceEnrollee(TestInfo): api-admin/build/test-results/test/TEST-bio.terra.pearl.api.admin.service.auth.EnforcePortalEnrolleePermissionTest.xml#L0
Failed test found in: api-admin/build/test-results/test/TEST-bio.terra.pearl.api.admin.service.auth.EnforcePortalEnrolleePermissionTest.xml api-admin/build/test-results/test/TEST-bio.terra.pearl.api.admin.service.auth.EnforcePortalEnrolleePermissionTest.xml api-admin/build/test-results/test/TEST-bio.terra.pearl.api.admin.service.auth.EnforcePortalEnrolleePermissionTest.xml api-admin/build/test-results/test/TEST-bio.terra.pearl.api.admin.service.auth.EnforcePortalEnrolleePermissionTest.xml api-admin/build/test-results/test/TEST-bio.terra.pearl.api.admin.service.auth.EnforcePortalEnrolleePermissionTest.xml api-admin/build/test-results/test/TEST-bio.terra.pearl.api.admin.service.auth.EnforcePortalEnrolleePermissionTest.xml api-admin/build/test-results/test/TEST-bio.terra.pearl.api.admin.service.auth.EnforcePortalEnrolleePermissionTest.xml api-admin/build/test-results/test/TEST-bio.terra.pearl.api.admin.service.auth.EnforcePortalEnrolleePermissionTest.xml api-admin/build/test-results/test/TEST-bio.terra.pearl.api.admin.service.auth.EnforcePortalEnrolleePermissionTest.xml Error: java.lang.IllegalStateException: Failed to load ApplicationContext for [WebMergedContextConfiguration@10aa1969 testClass = bio.terra.pearl.api.admin.service.auth.EnforcePortalEnrolleePermissionTest, locations = [], classes = [bio.terra.pearl.api.admin.ApiAdminApp], contextInitializerClasses = [], activeProfiles = ["test", "human-readable-logging"], propertySourceLocations = [], propertySourceProperties = ["org.springframework.boot.test.context.SpringBootTestContextBootstrapper=true"], contextCustomizers = [org.springframework.boot.test.autoconfigure.actuate.observability.ObservabilityContextCustomizerFactory$DisableObservabilityContextCustomizer@1f, org.springframework.boot.test.autoconfigure.properties.PropertyMappingContextCustomizer@0, org.springframework.boot.test.autoconfigure.web.servlet.WebDriverContextCustomizerFactory$Customizer@6b4125ed, org.springframework.boot.test.context.filter.ExcludeFilterContextCustomizer@6b321262, org.springframework.boot.test.json.DuplicateJsonObjectContextCustomizerFactory$DuplicateJsonObjectContextCustomizer@4ea17147, org.springframework.boot.test.mock.mockito.MockitoContextCustomizer@0, org.springframework.boot.test.web.client.TestRestTemplateContextCustomizer@7f6b2d9e, org.springframework.boot.test.web.reactive.server.WebTestClientContextCustomizer@7c540787, org.springframework.boot.test.context.SpringBootTestAnnotation@95d9e03b], resourceBasePath = "src/main/webapp", contextLoader = org.springframework.boot.test.context.SpringBootContextLoader, parent = null]
bio.terra.pearl.api.admin.service.auth.SandboxOnlyTest ► testSandboxOnlyMethodErrorsOnNull(): api-admin/build/test-results/test/TEST-bio.terra.pearl.api.admin.service.auth.SandboxOnlyTest.xml#L0
Failed test found in: api-admin/build/test-results/test/TEST-bio.terra.pearl.api.admin.service.auth.SandboxOnlyTest.xml api-admin/build/test-results/test/TEST-bio.terra.pearl.api.admin.service.auth.SandboxOnlyTest.xml api-admin/build/test-results/test/TEST-bio.terra.pearl.api.admin.service.auth.SandboxOnlyTest.xml api-admin/build/test-results/test/TEST-bio.terra.pearl.api.admin.service.auth.SandboxOnlyTest.xml Error: java.lang.IllegalStateException: Failed to load ApplicationContext for [WebMergedContextConfiguration@7ca4d6e8 testClass = bio.terra.pearl.api.admin.service.auth.SandboxOnlyTest, locations = [], classes = [bio.terra.pearl.api.admin.ApiAdminApp], contextInitializerClasses = [], activeProfiles = ["test", "human-readable-logging"], propertySourceLocations = [], propertySourceProperties = ["org.springframework.boot.test.context.SpringBootTestContextBootstrapper=true"], contextCustomizers = [org.springframework.boot.test.autoconfigure.actuate.observability.ObservabilityContextCustomizerFactory$DisableObservabilityContextCustomizer@1f, org.springframework.boot.test.autoconfigure.properties.PropertyMappingContextCustomizer@0, org.springframework.boot.test.autoconfigure.web.servlet.WebDriverContextCustomizerFactory$Customizer@6b4125ed, org.springframework.boot.test.context.filter.ExcludeFilterContextCustomizer@6b321262, org.springframework.boot.test.json.DuplicateJsonObjectContextCustomizerFactory$DuplicateJsonObjectContextCustomizer@4ea17147, org.springframework.boot.test.mock.mockito.MockitoContextCustomizer@0, org.springframework.boot.test.web.client.TestRestTemplateContextCustomizer@7f6b2d9e, org.springframework.boot.test.web.reactive.server.WebTestClientContextCustomizer@7c540787, org.springframework.boot.test.context.SpringBootTestAnnotation@95d9e03b], resourceBasePath = "src/main/webapp", contextLoader = org.springframework.boot.test.context.SpringBootContextLoader, parent = null]
bio.terra.pearl.api.admin.service.auth.SuperuserOnlyTest ► testSuperUserOnlyErrorsOnNull(): api-admin/build/test-results/test/TEST-bio.terra.pearl.api.admin.service.auth.SuperuserOnlyTest.xml#L0
Failed test found in: api-admin/build/test-results/test/TEST-bio.terra.pearl.api.admin.service.auth.SuperuserOnlyTest.xml api-admin/build/test-results/test/TEST-bio.terra.pearl.api.admin.service.auth.SuperuserOnlyTest.xml api-admin/build/test-results/test/TEST-bio.terra.pearl.api.admin.service.auth.SuperuserOnlyTest.xml api-admin/build/test-results/test/TEST-bio.terra.pearl.api.admin.service.auth.SuperuserOnlyTest.xml Error: java.lang.IllegalStateException: Failed to load ApplicationContext for [WebMergedContextConfiguration@1141456c testClass = bio.terra.pearl.api.admin.service.auth.SuperuserOnlyTest, locations = [], classes = [bio.terra.pearl.api.admin.ApiAdminApp], contextInitializerClasses = [], activeProfiles = ["test", "human-readable-logging"], propertySourceLocations = [], propertySourceProperties = ["org.springframework.boot.test.context.SpringBootTestContextBootstrapper=true"], contextCustomizers = [org.springframework.boot.test.autoconfigure.actuate.observability.ObservabilityContextCustomizerFactory$DisableObservabilityContextCustomizer@1f, org.springframework.boot.test.autoconfigure.properties.PropertyMappingContextCustomizer@0, org.springframework.boot.test.autoconfigure.web.servlet.WebDriverContextCustomizerFactory$Customizer@6b4125ed, org.springframework.boot.test.context.filter.ExcludeFilterContextCustomizer@6b321262, org.springframework.boot.test.json.DuplicateJsonObjectContextCustomizerFactory$DuplicateJsonObjectContextCustomizer@4ea17147, org.springframework.boot.test.mock.mockito.MockitoContextCustomizer@0, org.springframework.boot.test.web.client.TestRestTemplateContextCustomizer@7f6b2d9e, org.springframework.boot.test.web.reactive.server.WebTestClientContextCustomizer@7c540787, org.springframework.boot.test.context.SpringBootTestAnnotation@95d9e03b], resourceBasePath = "src/main/webapp", contextLoader = org.springframework.boot.test.context.SpringBootContextLoader, parent = null]
bio.terra.pearl.api.admin.service.dashboard.DashboardExtServiceTests ► testAuthentication(): api-admin/build/test-results/test/TEST-bio.terra.pearl.api.admin.service.dashboard.DashboardExtServiceTests.xml#L0
Failed test found in: api-admin/build/test-results/test/TEST-bio.terra.pearl.api.admin.service.dashboard.DashboardExtServiceTests.xml Error: java.lang.IllegalStateException: Failed to load ApplicationContext for [WebMergedContextConfiguration@e5900a4 testClass = bio.terra.pearl.api.admin.service.dashboard.DashboardExtServiceTests, locations = [], classes = [bio.terra.pearl.api.admin.ApiAdminApp], contextInitializerClasses = [], activeProfiles = ["test", "human-readable-logging"], propertySourceLocations = [], propertySourceProperties = ["org.springframework.boot.test.context.SpringBootTestContextBootstrapper=true"], contextCustomizers = [org.springframework.boot.test.autoconfigure.actuate.observability.ObservabilityContextCustomizerFactory$DisableObservabilityContextCustomizer@1f, org.springframework.boot.test.autoconfigure.properties.PropertyMappingContextCustomizer@0, org.springframework.boot.test.autoconfigure.web.servlet.WebDriverContextCustomizerFactory$Customizer@6b4125ed, org.springframework.boot.test.context.filter.ExcludeFilterContextCustomizer@6b321262, org.springframework.boot.test.json.DuplicateJsonObjectContextCustomizerFactory$DuplicateJsonObjectContextCustomizer@4ea17147, org.springframework.boot.test.mock.mockito.MockitoContextCustomizer@0, org.springframework.boot.test.web.client.TestRestTemplateContextCustomizer@7f6b2d9e, org.springframework.boot.test.web.reactive.server.WebTestClientContextCustomizer@7c540787, org.springframework.boot.test.context.SpringBootTestAnnotation@95d9e03b], resourceBasePath = "src/main/webapp", contextLoader = org.springframework.boot.test.context.SpringBootContextLoader, parent = null]
bio.terra.pearl.api.admin.service.dataimport.EnrolleeImportExtServiceTests ► testAuthentication(): api-admin/build/test-results/test/TEST-bio.terra.pearl.api.admin.service.dataimport.EnrolleeImportExtServiceTests.xml#L0
Failed test found in: api-admin/build/test-results/test/TEST-bio.terra.pearl.api.admin.service.dataimport.EnrolleeImportExtServiceTests.xml Error: java.lang.IllegalStateException: Failed to load ApplicationContext for [WebMergedContextConfiguration@36b9792 testClass = bio.terra.pearl.api.admin.service.dataimport.EnrolleeImportExtServiceTests, locations = [], classes = [bio.terra.pearl.api.admin.ApiAdminApp], contextInitializerClasses = [], activeProfiles = ["test", "human-readable-logging"], propertySourceLocations = [], propertySourceProperties = ["org.springframework.boot.test.context.SpringBootTestContextBootstrapper=true"], contextCustomizers = [org.springframework.boot.test.autoconfigure.actuate.observability.ObservabilityContextCustomizerFactory$DisableObservabilityContextCustomizer@1f, org.springframework.boot.test.autoconfigure.properties.PropertyMappingContextCustomizer@0, org.springframework.boot.test.autoconfigure.web.servlet.WebDriverContextCustomizerFactory$Customizer@6b4125ed, org.springframework.boot.test.context.filter.ExcludeFilterContextCustomizer@6b321262, org.springframework.boot.test.json.DuplicateJsonObjectContextCustomizerFactory$DuplicateJsonObjectContextCustomizer@4ea17147, org.springframework.boot.test.mock.mockito.MockitoContextCustomizer@0, org.springframework.boot.test.web.client.TestRestTemplateContextCustomizer@7f6b2d9e, org.springframework.boot.test.web.reactive.server.WebTestClientContextCustomizer@7c540787, org.springframework.boot.test.context.SpringBootTestAnnotation@95d9e03b], resourceBasePath = "src/main/webapp", contextLoader = org.springframework.boot.test.context.SpringBootContextLoader, parent = null]
bio.terra.pearl.api.admin.service.enrollee.EnrolleeExtServiceTests ► testAuthentication(): api-admin/build/test-results/test/TEST-bio.terra.pearl.api.admin.service.enrollee.EnrolleeExtServiceTests.xml#L0
Failed test found in: api-admin/build/test-results/test/TEST-bio.terra.pearl.api.admin.service.enrollee.EnrolleeExtServiceTests.xml api-admin/build/test-results/test/TEST-bio.terra.pearl.api.admin.service.enrollee.EnrolleeExtServiceTests.xml Error: java.lang.IllegalStateException: Failed to load ApplicationContext for [WebMergedContextConfiguration@785eaf4 testClass = bio.terra.pearl.api.admin.service.enrollee.EnrolleeExtServiceTests, locations = [], classes = [bio.terra.pearl.api.admin.ApiAdminApp], contextInitializerClasses = [], activeProfiles = ["test", "human-readable-logging"], propertySourceLocations = [], propertySourceProperties = ["org.springframework.boot.test.context.SpringBootTestContextBootstrapper=true"], contextCustomizers = [org.springframework.boot.test.autoconfigure.actuate.observability.ObservabilityContextCustomizerFactory$DisableObservabilityContextCustomizer@1f, org.springframework.boot.test.autoconfigure.properties.PropertyMappingContextCustomizer@0, org.springframework.boot.test.autoconfigure.web.servlet.WebDriverContextCustomizerFactory$Customizer@6b4125ed, org.springframework.boot.test.context.filter.ExcludeFilterContextCustomizer@6b321262, org.springframework.boot.test.json.DuplicateJsonObjectContextCustomizerFactory$DuplicateJsonObjectContextCustomizer@4ea17147, org.springframework.boot.test.mock.mockito.MockitoContextCustomizer@0, org.springframework.boot.test.web.client.TestRestTemplateContextCustomizer@7f6b2d9e, org.springframework.boot.test.web.reactive.server.WebTestClientContextCustomizer@7c540787, org.springframework.boot.test.context.SpringBootTestAnnotation@95d9e03b], resourceBasePath = "src/main/webapp", contextLoader = org.springframework.boot.test.context.SpringBootContextLoader, parent = null]
bio.terra.pearl.api.admin.service.enrollee.EnrolleeRelationExtServiceTest ► testAuthentication(): api-admin/build/test-results/test/TEST-bio.terra.pearl.api.admin.service.enrollee.EnrolleeRelationExtServiceTest.xml#L0
Failed test found in: api-admin/build/test-results/test/TEST-bio.terra.pearl.api.admin.service.enrollee.EnrolleeRelationExtServiceTest.xml api-admin/build/test-results/test/TEST-bio.terra.pearl.api.admin.service.enrollee.EnrolleeRelationExtServiceTest.xml api-admin/build/test-results/test/TEST-bio.terra.pearl.api.admin.service.enrollee.EnrolleeRelationExtServiceTest.xml Error: java.lang.IllegalStateException: Failed to load ApplicationContext for [WebMergedContextConfiguration@462e1aa3 testClass = bio.terra.pearl.api.admin.service.enrollee.EnrolleeRelationExtServiceTest, locations = [], classes = [bio.terra.pearl.api.admin.ApiAdminApp], contextInitializerClasses = [], activeProfiles = ["test", "human-readable-logging"], propertySourceLocations = [], propertySourceProperties = ["org.springframework.boot.test.context.SpringBootTestContextBootstrapper=true"], contextCustomizers = [org.springframework.boot.test.autoconfigure.actuate.observability.ObservabilityContextCustomizerFactory$DisableObservabilityContextCustomizer@1f, org.springframework.boot.test.autoconfigure.properties.PropertyMappingContextCustomizer@0, org.springframework.boot.test.autoconfigure.web.servlet.WebDriverContextCustomizerFactory$Customizer@6b4125ed, org.springframework.boot.test.context.filter.ExcludeFilterContextCustomizer@6b321262, org.springframework.boot.test.json.DuplicateJsonObjectContextCustomizerFactory$DuplicateJsonObjectContextCustomizer@4ea17147, org.springframework.boot.test.mock.mockito.MockitoContextCustomizer@0, org.springframework.boot.test.web.client.TestRestTemplateContextCustomizer@7f6b2d9e, org.springframework.boot.test.web.reactive.server.WebTestClientContextCustomizer@7c540787, org.springframework.boot.test.context.SpringBootTestAnnotation@95d9e03b], resourceBasePath = "src/main/webapp", contextLoader = org.springframework.boot.test.context.SpringBootContextLoader, parent = null]